{"text_format":"1","workbook":"xlsx","n_sheets":3,"sheets":["Order Sheet Summary","Order Pulling Sheet","Sheet1"],"not_rendered":{"charts":0,"images":1,"macros":1,"external_links":0,"defined_names":8,"comments":0,"pivot_tables":0},"unopened":[],"bounds":{"document_bytes":16777216,"sheet_cells":100000,"rows_first":2000,"rows_last":500,"rows_between":2000,"halvings":0,"cell_chars":16384,"cell_head_chars":4096},"cells_cut":0,"cells_raw":0,"read":"whole","date_system":"1900"}

{"sheet":"Order Sheet Summary","index":0,"n_rows":511,"n_cols":24,"rows_kept":511,"cut":false,"hidden":false,"merged":[[8,18,8,23],[0,8,0,17],[0,1,0,7],[1,1,1,7],[3,1,3,7],[4,1,4,7],[8,5,8,14],[8,15,8,17],[3,8,3,10],[4,8,4,10],[1,8,1,12],[6,1,6,23],[1,20,1,23]]}
[null,"Enter Your Group Name Here =",null,null,null,null,null,null,null,null,null,null,null,null,null,null,null,null,null,null,"Submit Order Online:"]
[null,"Enter Your Delivery Date Here =",null,null,null,null,null,null," ",null,null,null,null,null,null,null,null,null,null,null,"mariannasfundraisers.com/submit-your-order"]
[null,null,null,null,null,null,null,null,null,null,null,null,null,null,null,null,null,null,null,null,"...or Email to: mariannas@delgrossos.com"]
[null,"Enter Your Hoagie Delivery Price Here = ",null,null,null,null,null,null,null,null,null,null,null,null,null,null,null,null,null,null,"...or Call: (814) 684-2666 ext. 206"]
[null,"Enter Your Pizza Delivery Price Here = "]
[]
[null,"Don't forget to print your order pulling sheets.  See the \"Order Pulling Sheet\"  tab below!"]
[]
[null,null,null,null,null,"14\" Hoagies",null,null,null,null,null,null,null,null,null,"12\" Pizzas",null,null,"TOTALS"]
[null,null,"Total Items Sold",null,null,{"$f":"SUM(F12:F511)","v":0},{"$f":"SUM(G12:G511)","v":0},0,0,{"$f":"SUM(J12:J511)","v":0},0,0,{"$f":"SUM(M12:M511)","v":0},{"$f":"SUM(N12:N511)","v":0},0,0,0,0,0,0,0,0,0,0]
[null,"First Name","Last Name","Hidden Columns","Hidden Columns","Italian","All American","Ham & Swiss","Sweet Lebanon Bologna","Ham Club","Roast Beef","Smoked Ham & Cheddar","Turkey","Traditional","Three Cheese","Pepperoni","White","Cheese","Total Hoagies","Total Pizzas","Total Items Sold","Amount Due","Paid","Due"]
[1,null,null,{"$f":"CONCATENATE(C12,\", \",B12)","v":", "},{"$f":"A12","v":1},null,null,null,null,null,null,null,null,null,null,null,null,null,{"$f":"SUM(F12:O12)","v":0},{"$f":"SUM(P12:R12)","v":0},{"$f":"S12+T12","v":0},{"$f":"IFERROR(S12*$I$4+T12*$I$5,0)","v":0},null,{"$f":"V12-W12","v":0}]
[2,null,null,", ",2,null,null,null,null,null,null,null,null,null,null,null,null,null,{"$f":"SUM(F13:O13)","v":0},{"$f":"SUM(P13:R13)","v":0},{"$f":"S13+T13","v":0},{"$f":"IFERROR(S13*$I$4+T13*$I$5,0)","v":0},null,{"$f":"V13-W13","v":0}]
[3,null,null,", ",3,null,null,null,null,null,null,null,null,null,null,null,null,null,0,0,0,0,null,0]
[4,null,null,{"$f":"CONCATENATE(C15,\", \",B15)","v":", "},{"$f":"A15","v":4},null,null,null,null,null,null,null,null,null,null,null,null,null,0,0,0,0,null,{"$f":"V15-W15","v":0}]
[5,null,null,{"$f":"CONCATENATE(C16,\", \",B16)","v":", "},5,null,null,null,null,null,null,null,null,null,null,null,null,null,0,0,0,0,null,0]
[6,null,null,", ",6,null,null,null,null,null,null,null,null,null,null,null,null,null,0,0,0,0,null,0]
[7,null,null,", ",7,null,null,null,null,null,null,null,null,null,null,null,null,null,0,0,0,0,null,0]
[8,null,null,", ",8,null,null,null,null,null,null,null,null,null,null,null,null,null,0,0,0,0,null,0]
[9,null,null,", ",9,null,null,null,null,null,null,null,null,null,null,null,null,null,0,0,0,0,null,0]
[10,null,null,", ",10,null,null,null,null,null,null,null,null,null,null,null,null,null,0,0,0,0,null,0]
[11,null,null,", ",11,null,null,null,null,null,null,null,null,null,null,null,null,null,0,0,0,0,null,0]
[12,null,null,", ",12,null,null,null,null,null,null,null,null,null,null,null,null,null,0,0,0,0,null,0]
[13,null,null,", ",13,null,null,null,null,null,null,null,null,null,null,null,null,null,0,0,0,0,null,0]
[14,null,null,", ",14,null,null,null,null,null,null,null,null,null,null,null,null,null,0,0,0,0,null,0]
[15,null,null,", ",15,null,null,null,null,null,null,null,null,null,null,null,null,null,0,0,0,0,null,0]
[16,null,null,", ",16,null,null,null,null,null,null,null,null,null,null,null,null,null,0,0,{"$f":"S27+T27","v":0},0,null,{"$f":"V27-W27","v":0}]
[17,null,null,", ",17,null,null,null,null,null,null,null,null,null,null,null,null,null,0,0,0,0,null,0]
[18,null,null,", ",18,null,null,null,null,null,null,null,null,null,null,null,null,null,0,0,0,0,null,0]
[19,null,null,", ",19,null,null,null,null,null,null,null,null,null,null,null,null,null,0,0,0,0,null,0]
[20,null,null,", ",20,null,null,null,null,null,null,null,null,null,null,null,null,null,0,0,0,0,null,0]
[21,null,null,", ",21,null,null,null,null,null,null,null,null,null,null,null,null,null,0,0,0,0,null,0]
[22,null,null,", ",22,null,null,null,null,null,null,null,null,null,null,null,null,null,0,0,0,0,null,0]
[23,null,null,", ",23,null,null,null,null,null,null,null,null,null,null,null,null,null,0,0,0,0,null,0]
[24,null,null,", ",24,null,null,null,null,null,null,null,null,null,null,null,null,null,0,0,0,0,null,0]
[25,null,null,", ",25,null,null,null,null,null,null,null,null,null,null,null,null,null,0,0,0,0,null,0]
[26,null,null,", ",26,null,null,null,null,null,null,null,null,null,null,null,null,null,0,0,0,0,null,0]
[27,null,null,", ",27,null,null,null,null,null,null,null,null,null,null,null,null,null,0,0,0,0,null,0]
[28,null,null,", ",28,null,null,null,null,null,null,null,null,null,null,null,null,null,0,0,0,0,null,0]
[29,null,null,", ",29,null,null,null,null,null,null,null,null,null,null,null,null,null,0,0,0,0,null,0]
[30,null,null,", ",30,null,null,null,null,null,null,null,null,null,null,null,null,null,0,0,0,0,null,0]
[31,null,null,", ",31,null,null,null,null,null,null,null,null,null,null,null,null,null,{"$f":"SUM(F42:O42)","v":0},0,0,0,null,0]
[32,null,null,", ",32,null,null,null,null,null,null,null,null,null,null,null,null,null,0,0,0,0,null,0]
[33,null,null,", ",33,null,null,null,null,null,null,null,null,null,null,null,null,null,0,0,0,0,null,0]
[34,null,null,", ",34,null,null,null,null,null,null,null,null,null,null,null,null,null,0,0,0,0,null,0]
[35,null,null,", ",35,null,null,null,null,null,null,null,null,null,null,null,null,null,0,0,0,0,null,0]
[36,null,null,", ",36,null,null,null,null,null,null,null,null,null,null,null,null,null,0,0,0,0,null,0]
[37,null,null,", ",37,null,null,null,null,null,null,null,null,null,null,null,null,null,0,0,0,0,null,0]
[38,null,null,", ",38,null,null,null,null,null,null,null,null,null,null,null,null,null,0,0,0,0,null,0]
[39,null,null,", ",39,null,null,null,null,null,null,null,null,null,null,null,null,null,0,0,{"$f":"S50+T50","v":0},0,null,{"$f":"V50-W50","v":0}]
[40,null,null,", ",40,null,null,null,null,null,null,null,null,null,null,null,null,null,0,0,0,0,null,0]
[41,null,null,", ",41,null,null,null,null,null,null,null,null,null,null,null,null,null,0,0,0,0,null,0]
[42,null,null,", ",42,null,null,null,null,null,null,null,null,null,null,null,null,null,0,0,0,0,null,0]
[43,null,null,", ",43,null,null,null,null,null,null,null,null,null,null,null,null,null,0,0,0,0,null,0]
[44,null,null,", ",44,null,null,null,null,null,null,null,null,null,null,null,null,null,0,0,0,0,null,0]
[45,null,null,", ",45,null,null,null,null,null,null,null,null,null,null,null,null,null,0,0,0,0,null,0]
[46,null,null,", ",46,null,null,null,null,null,null,null,null,null,null,null,null,null,0,0,0,0,null,0]
[47,null,null,", ",47,null,null,null,null,null,null,null,null,null,null,null,null,null,0,0,{"$f":"S58+T58","v":0},0,null,{"$f":"V58-W58","v":0}]
[48,null,null,", ",48,null,null,null,null,null,null,null,null,null,null,null,null,null,0,0,0,0,null,0]
[49,null,null,", ",49,null,null,null,null,null,null,null,null,null,null,null,null,null,0,0,0,0,null,0]
[50,null,null,", ",50,null,null,null,null,null,null,null,null,null,null,null,null,null,0,0,0,0,null,0]
[51,null,null,", ",51,null,null,null,null,null,null,null,null,null,null,null,null,null,0,0,0,0,null,0]
[52,null,null,", ",52,null,null,null,null,null,null,null,null,null,null,null,null,null,0,0,0,0,null,0]
[53,null,null,", ",53,null,null,null,null,null,null,null,null,null,null,null,null,null,0,0,0,0,null,0]
[54,null,null,", ",54,null,null,null,null,null,null,null,null,null,null,null,null,null,0,0,0,0,null,0]
[55,null,null,", ",55,null,null,null,null,null,null,null,null,null,null,null,null,null,0,0,0,0,null,0]
[56,null,null,", ",56,null,null,null,null,null,null,null,null,null,null,null,null,null,0,0,0,0,null,0]
[57,null,null,", ",57,null,null,null,null,null,null,null,null,null,null,null,null,null,0,0,{"$f":"S68+T68","v":0},0,null,{"$f":"V68-W68","v":0}]
[58,null,null,", ",58,null,null,null,null,null,null,null,null,null,null,null,null,null,0,0,0,0,null,0]
[59,null,null,", ",59,null,null,null,null,null,null,null,null,null,null,null,null,null,0,0,0,0,null,0]
[60,null,null,", ",60,null,null,null,null,null,null,null,null,null,null,null,null,null,0,0,0,0,null,0]
[61,null,null,", ",61,null,null,null,null,null,null,null,null,null,null,null,null,null,0,0,0,0,null,0]
[62,null,null,", ",62,null,null,null,null,null,null,null,null,null,null,null,null,null,0,0,0,0,null,0]
[63,null,null,", ",63,null,null,null,null,null,null,null,null,null,null,null,null,null,0,0,0,0,null,0]
[64,null,null,", ",64,null,null,null,null,null,null,null,null,null,null,null,null,null,0,0,0,0,null,0]
[65,null,null,", ",65,null,null,null,null,null,null,null,null,null,null,null,null,null,0,0,0,0,null,0]
[66,null,null,{"$f":"CONCATENATE(C77,\", \",B77)","v":", "},{"$f":"A77","v":66},null,null,null,null,null,null,null,null,null,null,null,null,null,{"$f":"SUM(F77:O77)","v":0},{"$f":"SUM(P77:R77)","v":0},0,{"$f":"IFERROR(S77*$I$4+T77*$I$5,0)","v":0},null,0]
[67,null,null,", ",67,null,null,null,null,null,null,null,null,null,null,null,null,null,0,0,0,0,null,0]
[68,null,null,", ",68,null,null,null,null,null,null,null,null,null,null,null,null,null,0,0,0,0,null,0]
[69,null,null,", ",69,null,null,null,null,null,null,null,null,null,null,null,null,null,0,0,0,0,null,0]
[70,null,null,", ",70,null,null,null,null,null,null,null,null,null,null,null,null,null,0,0,0,0,null,0]
[71,null,null,", ",71,null,null,null,null,null,null,null,null,null,null,null,null,null,0,0,0,0,null,0]
[72,null,null,", ",72,null,null,null,null,null,null,null,null,null,null,null,null,null,0,0,0,0,null,0]
[73,null,null,", ",73,null,null,null,null,null,null,null,null,null,null,null,null,null,0,0,0,0,null,0]
[74,null,null,", ",74,null,null,null,null,null,null,null,null,null,null,null,null,null,0,0,0,0,null,0]
[75,null,null,", ",75,null,null,null,null,null,null,null,null,null,null,null,null,null,0,0,0,0,null,0]
[76,null,null,", ",76,null,null,null,null,null,null,null,null,null,null,null,null,null,0,0,0,0,null,0]
[77,null,null,", ",77,null,null,null,null,null,null,null,null,null,null,null,null,null,0,0,0,0,null,0]
[78,null,null,", ",78,null,null,null,null,null,null,null,null,null,null,null,null,null,0,0,0,0,null,0]
[79,null,null,", ",79,null,null,null,null,null,null,null,null,null,null,null,null,null,0,0,0,0,null,0]
[80,null,null,", ",80,null,null,null,null,null,null,null,null,null,null,null,null,null,0,0,0,0,null,0]
[81,null,null,", ",81,null,null,null,null,null,null,null,null,null,null,null,null,null,0,0,0,0,null,0]
[82,null,null,", ",82,null,null,null,null,null,null,null,null,null,null,null,null,null,0,0,0,0,null,0]
[83,null,null,", ",83,null,null,null,null,null,null,null,null,null,null,null,null,null,0,0,0,0,null,0]
[84,null,null,", ",84,null,null,null,null,null,null,null,null,null,null,null,null,null,0,0,0,0,null,0]
[85,null,null,", ",85,null,null,null,null,null,null,null,null,null,null,null,null,null,0,0,0,0,null,0]
[86,null,null,", ",86,null,null,null,null,null,null,null,null,null,null,null,null,null,0,0,0,0,null,0]
[87,null,null,", ",87,null,null,null,null,null,null,null,null,null,null,null,null,null,0,0,0,0,null,0]
[88,null,null,", ",88,null,null,null,null,null,null,null,null,null,null,null,null,null,0,0,0,0,null,0]
[89,null,null,", ",89,null,null,null,null,null,null,null,null,null,null,null,null,null,0,0,0,0,null,0]
[90,null,null,", ",90,null,null,null,null,null,null,null,null,null,null,null,null,null,0,0,0,0,null,0]
[91,null,null,", ",91,null,null,null,null,null,null,null,null,null,null,null,null,null,0,0,0,0,null,0]
[92,null,null,", ",92,null,null,null,null,null,null,null,null,null,null,null,null,null,0,0,0,0,null,0]
[93,null,null,", ",93,null,null,null,null,null,null,null,null,null,null,null,null,null,0,0,0,0,null,0]
[94,null,null,", ",94,null,null,null,null,null,null,null,null,null,null,null,null,null,0,0,0,0,null,0]
[95,null,null,", ",95,null,null,null,null,null,null,null,null,null,null,null,null,null,0,0,0,0,null,0]
[96,null,null,", ",96,null,null,null,null,null,null,null,null,null,null,null,null,null,0,0,0,0,null,0]
[97,null,null,", ",97,null,null,null,null,null,null,null,null,null,null,null,null,null,0,0,0,0,null,0]
[98,null,null,", ",98,null,null,null,null,null,null,null,null,null,null,null,null,null,0,0,0,0,null,0]
[99,null,null,", ",99,null,null,null,null,null,null,null,null,null,null,null,null,null,0,0,0,0,null,0]
[100,null,null,", ",100,null,null,null,null,null,null,null,null,null,null,null,null,null,0,0,0,0,null,0]
[101,null,null,", ",101,null,null,null,null,null,null,null,null,null,null,null,null,null,0,0,0,0,null,0]
[102,null,null,", ",102,null,null,null,null,null,null,null,null,null,null,null,null,null,0,0,0,0,null,0]
[103,null,null,", ",103,null,null,null,null,null,null,null,null,null,null,null,null,null,0,0,0,0,null,0]
[104,null,null,", ",104,null,null,null,null,null,null,null,null,null,null,null,null,null,0,0,0,0,null,0]
[105,null,null,", ",105,null,null,null,null,null,null,null,null,null,null,null,null,null,0,0,0,0,null,0]
[106,null,null,", ",106,null,null,null,null,null,null,null,null,null,null,null,null,null,0,0,0,0,null,0]
[107,null,null,", ",107,null,null,null,null,null,null,null,null,null,null,null,null,null,0,0,0,0,null,0]
[108,null,null,", ",108,null,null,null,null,null,null,null,null,null,null,null,null,null,0,0,0,0,null,0]
[109,null,null,", ",109,null,null,null,null,null,null,null,null,null,null,null,null,null,0,0,0,0,null,0]
[110,null,null,", ",110,null,null,null,null,null,null,null,null,null,null,null,null,null,0,0,0,0,null,0]
[111,null,null,", ",111,null,null,null,null,null,null,null,null,null,null,null,null,null,0,0,0,0,null,0]
[112,null,null,", ",112,null,null,null,null,null,null,null,null,null,null,null,null,null,0,0,0,0,null,0]
[113,null,null,", ",113,null,null,null,null,null,null,null,null,null,null,null,null,null,0,0,0,0,null,0]
[114,null,null,", ",114,null,null,null,null,null,null,null,null,null,null,null,null,null,0,0,0,0,null,0]
[115,null,null,", ",115,null,null,null,null,null,null,null,null,null,null,null,null,null,0,0,0,0,null,0]
[116,null,null,", ",116,null,null,null,null,null,null,null,null,null,null,null,null,null,0,0,0,0,null,0]
[117,null,null,", ",117,null,null,null,null,null,null,null,null,null,null,null,null,null,0,0,0,0,null,0]
[118,null,null,", ",118,null,null,null,null,null,null,null,null,null,null,null,null,null,0,0,0,0,null,0]
[119,null,null,", ",119,null,null,null,null,null,null,null,null,null,null,null,null,null,0,0,0,0,null,0]
[120,null,null,", ",120,null,null,null,null,null,null,null,null,null,null,null,null,null,0,0,0,0,null,0]
[121,null,null,", ",121,null,null,null,null,null,null,null,null,null,null,null,null,null,0,0,{"$f":"S132+T132","v":0},0,null,{"$f":"V132-W132","v":0}]
[122,null,null,", ",122,null,null,null,null,null,null,null,null,null,null,null,null,null,0,0,0,0,null,0]
[123,null,null,", ",123,null,null,null,null,null,null,null,null,null,null,null,null,null,0,0,0,0,null,0]
[124,null,null,", ",124,null,null,null,null,null,null,null,null,null,null,null,null,null,0,0,0,0,null,0]
[125,null,null,", ",125,null,null,null,null,null,null,null,null,null,null,null,null,null,0,0,0,0,null,0]
[126,null,null,", ",126,null,null,null,null,null,null,null,null,null,null,null,null,null,0,0,0,0,null,0]
[127,null,null,", ",127,null,null,null,null,null,null,null,null,null,null,null,null,null,0,0,0,0,null,0]
[128,null,null,", ",128,null,null,null,null,null,null,null,null,null,null,null,null,null,0,0,0,0,null,0]
[129,null,null,", ",129,null,null,null,null,null,null,null,null,null,null,null,null,null,0,0,0,0,null,0]
[130,null,null,{"$f":"CONCATENATE(C141,\", \",B141)","v":", "},{"$f":"A141","v":130},null,null,null,null,null,null,null,null,null,null,null,null,null,{"$f":"SUM(F141:O141)","v":0},{"$f":"SUM(P141:R141)","v":0},0,{"$f":"IFERROR(S141*$I$4+T141*$I$5,0)","v":0},null,0]
[131,null,null,", ",131,null,null,null,null,null,null,null,null,null,null,null,null,null,0,0,0,0,null,0]
[132,null,null,", ",132,null,null,null,null,null,null,null,null,null,null,null,null,null,0,0,0,0,null,0]
[133,null,null,", ",133,null,null,null,null,null,null,null,null,null,null,null,null,null,0,0,0,0,null,0]
[134,null,null,", ",134,null,null,null,null,null,null,null,null,null,null,null,null,null,0,0,0,0,null,0]
[135,null,null,", ",135,null,null,null,null,null,null,null,null,null,null,null,null,null,0,0,0,0,null,0]
[136,null,null,", ",136,null,null,null,null,null,null,null,null,null,null,null,null,null,0,0,0,0,null,0]
[137,null,null,", ",137,null,null,null,null,null,null,null,null,null,null,null,null,null,0,0,0,0,null,0]
[138,null,null,", ",138,null,null,null,null,null,null,null,null,null,null,null,null,null,0,0,0,0,null,0]
[139,null,null,", ",139,null,null,null,null,null,null,null,null,null,null,null,null,null,0,0,0,0,null,0]
[140,null,null,", ",140,null,null,null,null,null,null,null,null,null,null,null,null,null,0,0,0,0,null,0]
[141,null,null,", ",141,null,null,null,null,null,null,null,null,null,null,null,null,null,0,0,0,0,null,0]
[142,null,null,", ",142,null,null,null,null,null,null,null,null,null,null,null,null,null,0,0,0,0,null,0]
[143,null,null,", ",143,null,null,null,null,null,null,null,null,null,null,null,null,null,0,0,0,0,null,0]
[144,null,null,", ",144,null,null,null,null,null,null,null,null,null,null,null,null,null,0,0,0,0,null,0]
[145,null,null,", ",145,null,null,null,null,null,null,null,null,null,null,null,null,null,0,0,0,0,null,0]
[146,null,null,", ",146,null,null,null,null,null,null,null,null,null,null,null,null,null,0,0,0,0,null,0]
[147,null,null,", ",147,null,null,null,null,null,null,null,null,null,null,null,null,null,0,0,0,0,null,0]
[148,null,null,", ",148,null,null,null,null,null,null,null,null,null,null,null,null,null,0,0,0,0,null,0]
[149,null,null,", ",149,null,null,null,null,null,null,null,null,null,null,null,null,null,0,0,0,0,null,0]
[150,null,null,", ",150,null,null,null,null,null,null,null,null,null,null,null,null,null,0,0,0,0,null,0]
[151,null,null,", ",151,null,null,null,null,null,null,null,null,null,null,null,null,null,0,0,0,0,null,0]
[152,null,null,", ",152,null,null,null,null,null,null,null,null,null,null,null,null,null,0,0,0,0,null,0]
[153,null,null,", ",153,null,null,null,null,null,null,null,null,null,null,null,null,null,0,0,0,0,null,0]
[154,null,null,", ",154,null,null,null,null,null,null,null,null,null,null,null,null,null,0,0,0,0,null,0]
[155,null,null,", ",155,null,null,null,null,null,null,null,null,null,null,null,null,null,0,0,0,0,null,0]
[156,null,null,", ",156,null,null,null,null,null,null,null,null,null,null,null,null,null,0,0,0,0,null,0]
[157,null,null,", ",157,null,null,null,null,null,null,null,null,null,null,null,null,null,0,0,0,0,null,0]
[158,null,null,", ",158,null,null,null,null,null,null,null,null,null,null,null,null,null,0,0,0,0,null,0]
[159,null,null,", ",159,null,null,null,null,null,null,null,null,null,null,null,null,null,0,0,0,0,null,0]
[160,null,null,", ",160,null,null,null,null,null,null,null,null,null,null,null,null,null,0,0,0,0,null,0]
[161,null,null,", ",161,null,null,null,null,null,null,null,null,null,null,null,null,null,0,0,0,0,null,0]
[162,null,null,", ",162,null,null,null,null,null,null,null,null,null,null,null,null,null,0,0,0,0,null,0]
[163,null,null,", ",163,null,null,null,null,null,null,null,null,null,null,null,null,null,0,0,0,0,null,0]
[164,null,null,", ",164,null,null,null,null,null,null,null,null,null,null,null,null,null,0,0,0,0,null,0]
[165,null,null,", ",165,null,null,null,null,null,null,null,null,null,null,null,null,null,0,0,0,0,null,0]
[166,null,null,", ",166,null,null,null,null,null,null,null,null,null,null,null,null,null,0,0,0,0,null,0]
[167,null,null,", ",167,null,null,null,null,null,null,null,null,null,null,null,null,null,0,0,0,0,null,0]
[168,null,null,", ",168,null,null,null,null,null,null,null,null,null,null,null,null,null,0,0,0,0,null,0]
[169,null,null,", ",169,null,null,null,null,null,null,null,null,null,null,null,null,null,0,0,0,0,null,0]
[170,null,null,", ",170,null,null,null,null,null,null,null,null,null,null,null,null,null,0,0,0,0,null,0]
[171,null,null,", ",171,null,null,null,null,null,null,null,null,null,null,null,null,null,0,0,0,0,null,0]
[172,null,null,", ",172,null,null,null,null,null,null,null,null,null,null,null,null,null,0,0,0,0,null,0]
[173,null,null,", ",173,null,null,null,null,null,null,null,null,null,null,null,null,null,0,0,0,0,null,0]
[174,null,null,", ",174,null,null,null,null,null,null,null,null,null,null,null,null,null,0,0,0,0,null,0]
[175,null,null,", ",175,null,null,null,null,null,null,null,null,null,null,null,null,null,0,0,0,0,null,0]
[176,null,null,", ",176,null,null,null,null,null,null,null,null,null,null,null,null,null,0,0,0,0,null,0]
[177,null,null,", ",177,null,null,null,null,null,null,null,null,null,null,null,null,null,0,0,0,0,null,0]
[178,null,null,", ",178,null,null,null,null,null,null,null,null,null,null,null,null,null,0,0,0,0,null,0]
[179,null,null,", ",179,null,null,null,null,null,null,null,null,null,null,null,null,null,0,0,0,0,null,0]
[180,null,null,", ",180,null,null,null,null,null,null,null,null,null,null,null,null,null,0,0,0,0,null,0]
[181,null,null,", ",181,null,null,null,null,null,null,null,null,null,null,null,null,null,0,0,0,0,null,0]
[182,null,null,", ",182,null,null,null,null,null,null,null,null,null,null,null,null,null,0,0,0,0,null,0]
[183,null,null,", ",183,null,null,null,null,null,null,null,null,null,null,null,null,null,0,0,0,0,null,0]
[184,null,null,", ",184,null,null,null,null,null,null,null,null,null,null,null,null,null,0,0,0,0,null,0]
[185,null,null,", ",185,null,null,null,null,null,null,null,null,null,null,null,null,null,0,0,{"$f":"S196+T196","v":0},0,null,{"$f":"V196-W196","v":0}]
[186,null,null,", ",186,null,null,null,null,null,null,null,null,null,null,null,null,null,0,0,0,0,null,0]
[187,null,null,", ",187,null,null,null,null,null,null,null,null,null,null,null,null,null,0,0,0,0,null,0]
[188,null,null,", ",188,null,null,null,null,null,null,null,null,null,null,null,null,null,0,0,0,0,null,0]
[189,null,null,", ",189,null,null,null,null,null,null,null,null,null,null,null,null,null,0,0,0,0,null,0]
{"$rows_left_out":312}
{"sheet":"Order Pulling Sheet","index":1,"n_rows":23,"n_cols":4,"rows_kept":23,"cut":false,"hidden":false,"merged":[[0,1,0,2],[2,1,2,2],[22,0,22,2],[7,3,7,12],[8,3,8,12],[5,3,5,12],[4,3,4,12]]}
["Seller Name:",", "]
[]
["Summary Sheet Order #:",{"$f":"IFERROR(VLOOKUP(B1,'Order Sheet Summary'!$D$12:$E$511,2,FALSE),0)","v":1}]
[]
["Italian",{"$f":"IFERROR(VLOOKUP($B$1,'Order Sheet Summary'!$D$12:$R$511,3,FALSE),0)","v":0},null,"BEFORE PRINTING CLICK ON SECURITY BOX THAT MAY POP UP:"]
["All American",{"$f":"IFERROR(VLOOKUP($B$1,'Order Sheet Summary'!$D$12:$R$511,4,FALSE),0)","v":0},null,"Enable Content On - SECURITY WARNING- MACROS HAS BEEN DISABLED"]
["Ham & Swiss",{"$f":"IFERROR(VLOOKUP($B$1,'Order Sheet Summary'!$D$12:$R$511,5,FALSE),0)","v":0}]
["Sweet Lebanon Bologna",{"$f":"IFERROR(VLOOKUP($B$1,'Order Sheet Summary'!$D$12:$R$511,6,FALSE),0)","v":0},null,"TO PRINT ALL OF THE SHEETS LISTED ON THE ORDER SHEET SUMMARY:"]
["Ham Club",{"$f":"IFERROR(VLOOKUP($B$1,'Order Sheet Summary'!$D$12:$R$511,7,FALSE),0)","v":0},null,"Check printer settings: 1. Default Printer 2. Correct paper/tray 3. One sided printing"]
["Roast Beef",{"$f":"IFERROR(VLOOKUP($B$1,'Order Sheet Summary'!$D$12:$R$511,8,FALSE),0)","v":0},null,"PRESS  \"CTRL\" + \"A\""]
["Smoked Ham & Cheddar",{"$f":"IFERROR(VLOOKUP($B$1,'Order Sheet Summary'!$D$12:$R$511,9,FALSE),0)","v":0}]
["Turkey",{"$f":"IFERROR(VLOOKUP($B$1,'Order Sheet Summary'!$D$12:$R$511,10,FALSE),0)","v":0},null,"TO PRINT OFF PULL SHEETS FOR AN INDIVIDUAL SELLER:"]
["Traditional",{"$f":"IFERROR(VLOOKUP($B$1,'Order Sheet Summary'!$D$12:$R$511,11,FALSE),0)","v":0},null,"Click on the field to the right of the seller’s name."]
["Three Cheese",{"$f":"IFERROR(VLOOKUP($B$1,'Order Sheet Summary'!$D$12:$R$511,12,FALSE),0)","v":0},null,"Click on the drop down menu arrow and scroll to see name."]
["Total Hoagies",{"$f":"SUM(B5:B14)","v":0},null,"Select the name you want and their order will auto populate in the picking sheet."]
[null,null,null,"Press print from your programs menu, ensure print settings are correct."]
["Pepperoni",{"$f":"IFERROR(VLOOKUP($B$1,'Order Sheet Summary'!$D$12:$R$511,13,FALSE),0)","v":0},null,"Repeat this for each seller as needed."]
["White",{"$f":"IFERROR(VLOOKUP($B$1,'Order Sheet Summary'!$D$12:$R$511,14,FALSE),0)","v":0}]
["Cheese",{"$f":"IFERROR(VLOOKUP($B$1,'Order Sheet Summary'!$D$12:$R$511,15,FALSE),0)","v":0}]
["Total Pizzas",{"$f":"SUM(B17:B19)","v":0}]
[]
["I Acknowledge receipt of the items listed above:   "]
["Signature:__________________ Date:_________"]

{"sheet":"Sheet1","index":2,"n_rows":0,"n_cols":0,"rows_kept":0,"cut":false,"hidden":false,"merged":[]}